{"text_format":"1","workbook":"xlsx","n_sheets":3,"sheets":["EZR","Hinweise","alt"],"not_rendered":{"charts":0,"images":1,"macros":1,"external_links":0,"defined_names":5,"comments":0,"pivot_tables":0},"unopened":[],"bounds":{"document_bytes":16777216,"sheet_cells":100000,"rows_first":2000,"rows_last":500,"rows_between":2000,"halvings":0,"cell_chars":16384,"cell_head_chars":4096},"cells_cut":0,"cells_raw":0,"read":"whole","date_system":"1900"}

{"sheet":"EZR","index":0,"n_rows":30,"n_cols":10,"rows_kept":30,"cut":false,"hidden":false,"merged":[[1,1,1,9],[19,1,19,9],[0,1,0,9],[2,1,2,9],[3,7,3,9],[11,4,11,9],[12,1,12,9],[5,2,5,8],[9,4,10,9],[29,2,29,9],[25,2,25,9],[24,2,24,9],[23,2,23,9],[28,2,28,9],[27,2,27,9],[26,2,26,9],[22,2,22,9],[11,2,11,3],[3,2,3,6],[9,2,9,3],[20,1,20,9],[14,7,14,8],[13,7,13,8],[15,7,15,8],[16,7,16,8],[17,7,17,8],[18,7,18,8],[21,2,21,9],[4,1,4,9],[7,2,7,3]]}
[null,"Zuschuss-Rechner"]
[]
[]
[null,"Förderprogramm",null,null,null,null,null,{"$f":"IF(C4=\"\",\"Bitte auswählen!\",\"\")","v":"Bitte auswählen!"}]
[]
[null,{"$f":"IF(OR(C4=\"Betriebsberatung Sachsen\",C4=\"Coaching Sachsen\"),\"Schwerpunkt\",\"\")","v":""},null,null,null,null,null,null,null,"Bitte auswählen!"]
[]
[null,{"$f":"IF(AND(C6<>\"Umweltmanagement\",OR(C4=\"Betriebsberatung Sachsen\")),\"jahresübergreifend?\",\"\")","v":""},null,null,"Bitte auswählen!"]
[]
[null,{"$f":"IF(OR(C4=\"Gründungsrichtlinie Thüringen\",C4=\"Beratungsrichtlinie Thüringen\"),\"Anzahl Tagwerke (TW)\",\"Anzahl Tagewerke (TW)\")","v":"Anzahl Tagewerke (TW)"},null,null,{"$f":"IF(AND(C4=\"Betriebsberatung Sachsen\",C6=\"\"),\"max. 23 bzw. 28, min. 5\",\nIF(AND(C4=\"Betriebsberatung Sachsen\",C8<>\"ja\",OR(C6=\"Strategieentwicklung\",C6=\"Digitalisierung des Geschäftsmodells\",C6=\"Umweltberatung\",C6=\"Wissensbilanz\")),\"max. 23, \"&VLOOKUP(C4,Hinweise!A:I,5,FALSE),\nIF(AND(C4=\"Betriebsberatung Sachsen\",C8=\"ja\",OR(C6=\"\",C6=\"Strategieentwicklung\",C6=\"Digitalisierung des Geschäftsmodells\",C6=\"Umweltberatung\",C6=\"Wissensbilanz\")),\"max. 46, \"&VLOOKUP(C4,Hinweise!A:I,5,FALSE),\nIF(AND(C4=\"Betriebsberatung Sachsen\",C8<>\"ja\",OR(C6=\"Personalentwicklung und Fachkräftesicherung\",C6=\"Unternehmensnachfolge\",C6=\"In- und ausländische Märkte\")),\"max. 28, \"&VLOOKUP(C4,Hinweise!A:I,5,FALSE),\nIF(AND(C4=\"Betriebsberatung Sachsen\",C8=\"ja\",OR(C6=\"Personalentwicklung und Fachkräftesicherung\",C6=\"Unternehmensnachfolge\",C6=\"In- und ausländische Märkte\")),\"max. 56, \"&VLOOKUP(C4,Hinweise!A:I,5,FALSE),\nIF(AND(C4=\"Coaching Sachsen\",OR(C6=\"Strategieentwicklung\",C6=\"Digitalisierung des Geschäftsmodells\",C6=\"Umweltberatung\",C6=\"Wissensbilanz\")),\"max. 12,  \"&VLOOKUP(C4,Hinweise!A:I,5,FALSE),\nIF(AND(C4=\"Coaching Sachsen\",OR(C6=\"Personalentwicklung und Fachkräftesicherung\",C6=\"Unternehmensnachfolge\",C6=\"In- und ausländische Märkte\")),\"max. 14, \"&VLOOKUP(C4,Hinweise!A:I,5,FALSE),\nIF(AND(C4=\"Coaching Sachsen\",C6=\"Umweltmanagement\"),\"kein Coaching für Umweltmanagement möglich\",\nIF(AND(C4=\"Betriebsberatung Sachsen\",C6=\"Umweltmanagement\"),\"max. 17,  \"&VLOOKUP(C4,Hinweise!A:I,5,FALSE),IF(C4>\"\",VLOOKUP(C4,Hinweise!A:I,5,FALSE),\"\"))))))))))","v":""}]
[]
[null,"Beraterhonorar je TW",null,null,"€ (netto)"]
[]
[null,"Kosten","TW",null,"Honorar",null,"tatsächliche Kosten","förderfähige Kosten",null,{"$f":"IF(AND(C6=1,OR(C4=\"Betriebsberatung Sachsen\",C4=\"Coaching Sachsen\")),\"Schwerpunkt \"\"In- und ausländische Märkte\"\", \"\"Personalentwicklung und Fachkräfte-sicherung\"\" oder \"\"Unternehmensnachfolge\"\" gewählt - förderfähige Gesamtkosten nun max. 20.000 €\",\"\")","v":""}]
[null,"Beraterhonorar",{"$f":"C10","v":0},"x",{"$f":"C12","v":0},"=",{"$f":"IF(C10>0,C15*E15,0)","v":0},{"$f":"IF(C4=\"Gründungsrichtlinie Thüringen\",IF(C12>765,765*C10,C12*C10),\n(IF(C4=\"Beratungsrichtlinie Thüringen\",IF(C12>850,850*C10,C12*C10),\nIF(C4=\"BAFA Junge Unternehmen\",IF(G17>4000,4000-G16,H17-G16),\nIF(C4=\"BAFA Bestandsunternehmen\",IF(G17>3000,3000-G16,H17-G16),\nIF(C4=\"Betriebsberatung Sachsen\",IF(E15>620,620*C10,G15),\nIF(C4=\"Coaching Sachsen\",IF(E15>620,620*C10,G15),\nIF(C4=\"\",\"\"))))))))","v":""},null,{"$f":"IF(OR(C4=\"Betriebsberatung Sachsen\",C4=\"Coaching Sachsen\"),IF(E15>620,\"reduziert förderfähig, da Honorar über 620 €/TW\",\"\"),\nIF(AND(C4=\"Gründungsrichtlinie Thüringen\",C10>20,C10>0),\"Bitte Ellipsis bzgl. Beratungsumfang kontaktieren!\",IF(AND(C4=\"Gründungsrichtlinie Thüringen\",C10<3,C10>0),\"Bitte Ellipsis bzgl. Beratungsumfang kontaktieren!\",IF(AND(C4=\"Gründungsrichtlinie Thüringen\",C10>20,C10>0),\"Bitte Ellipsis bzgl. Beratungsumfang kontaktieren!\",IF(AND(C4=\"Beratungsrichtlinie Thüringen\",C10<6,C10>0),\"Bitte Ellipsis bzgl. Beratungsumfang kontaktieren!\",\"\")))))","v":""}]
{"$rows_left_out":16}
{"sheet":"Hinweise","index":1,"n_rows":15,"n_cols":9,"rows_kept":15,"cut":false,"hidden":true,"merged":[]}
[null,"Name des Förderprogramms","Zuständig für Zuwendungsbescheid","Unternehmensalter","Mögliche Anzahl Tagewerke","Zuschuss","Beratungsinhalte","Ellipsis Deckungsbeitrag","Wichtige Hinweise"]
["Gründungsrichtlinie Thüringen","Thüringer Beratungsrichtlinie","TAB - Thüringer Aufbaubank","vor Gründung","max. 20, min. 3","Pauschale von 692 € pro Tagwerk\n\nGrundlage der Pauschale ist ein Zuschuss von 80% auf den Standardeinheitskostensatz (SEK; \"angenommene Tagwerkkosten\") von 865 € netto.\n\nDie Qualitätssicherungskosten von 110 € pro Tagwerk sind im SEK enthalten.","Die Beratungen umfassen folgende Schwerpunkte:\n- Strategien und Geschäftsideen\n- Personal und Organisation\n- Finanzierung und Investitionen\n- Unternehmenswachstum und Wettbewerbsfähigkeit\n- Technologietransfer und Technologieanwendung\n- Produktportfolio\n- Marktanalysen und Marketing\n- Materialeffizienz\n- Unternehmensnachfolge\n- Nachhaltigkeit und Anpassung an den Klimawandel\n- Darüber hinaus sind weitere Beratungsschwerpunkte zulässig.",110,"Von einer Förderung sind grundsätzlich ausgeschlossen:\n\n- Beratungen, die mit weniger als 3 Tagwerken sachgerecht erledigt werden können.\n- allgemeine Situationsanalysen,\n        die der Vermittlung von Basiswissen für eine sachgerechte Betriebsführung dienen,\n        die Rechts-, Akquisitions-, Versicherungs- und Steuerfragen zum Inhalt haben,\n        die mit anderen öffentlichen Zuschüssen finanziert werden (Kumulierungsverbot),\n        in deren Rahmen Waren oder Dienstleistungen angeboten oder vertrieben werden,\n- die Aufstellung von Neu- und Umbauplänen,\n- die Ausarbeitung von Verträgen,\n- die Aufstellung von Jahresabschlüssen (Bilanz, Gewinn- und Verlustrechnung) und Buchführungsarbeiten,\n- die Erarbeitung von EDV-Software und Werbematerialien (Internetauftritt),\n- gutachterliche Stellungnahmen,\n- Qualitätsprüfungen sowie technische, chemische und ähnliche Untersuchungen.\n\nVoraussetzung für eine Förderung ist die Einbeziehung eines neutralen Qualitätssicherers durch den Zuwendungsempfänger. Mit diesem hat der Zuwendungsempfänger einen Qualitätssicherungsvertrag abzuschließen.\n\nZuwendungen nach der Gründungsrichtlinie Ziffer 2.1 werden als \"De-minimis\"-Beihilfen gemäß der \"De-minimis\"-VO gewährt."]
["Beratungsrichtlinie Thüringen","Thüringer Beratungsrichtlinie","TAB - Thüringer Aufbaubank","ab 1. Tag der Gründung, BAFA für Junge Unternehmen ist vorher auszuschöpfen","in der Regel max. 20, min. 6","Pauschale von 475 € pro Tagwerk\n\nGrundlage der Pauschale ist ein Zuschuss von 50% auf den Standardeinheitskostensatz (SEK; \"angenommene Tagwerkkosten\") von 950 € netto.\n\nDie Qualitätssicherungskosten von 110 € pro Tagwerk sind im SEK enthalten.","Die Beratungen umfassen folgende Schwerpunkte:\n- Unternehmenswachstum und Wettbewerbsfähigkeit\n- Finanzierung und Investitionen\n- Unternehmensnachfolge\n- Innovationsmanagement\n- Internationalisierung\n- Rationalisierungsmaßnahmen und Kostensenkungen, Technologietransfer und zur Technologieanwendung\n- Produktportfolio, Marktanalysen und Marketing\n- Strategie und Geschäftsideen\n- Materialeffizienz\n- Personalmanagement/Organisationsentwicklung\n- Kooperation von Unternehmen und - Nachhaltigkeit und Anpassung an den Klimawandel\n- Darüber hinaus sind weitere Beratungsschwerpunkte zulässig.",110,"Von einer Förderung sind grundsätzlich ausgeschlossen:\n\n- Beratungen, die mit weniger als 6 Tagwerken sachgerecht erledigt werden können.\n- allgemeine Situationsanalysen,\n        die der Vermittlung von Basiswissen für eine sachgerechte Betriebsführung dienen,\n        die Rechts-, Akquisitions-, Versicherungs- und Steuerfragen zum Inhalt haben,\n        die mit anderen öffentlichen Zuschüssen finanziert werden (Kumulierungsverbot),\n        in deren Rahmen Waren oder Dienstleistungen angeboten oder vertrieben werden,\n- die Aufstellung von Neu- und Umbauplänen,\n- die Ausarbeitung von Verträgen,\n- die Aufstellung von Jahresabschlüssen (Bilanz, Gewinn- und Verlustrechnung) und Buchführungsarbeiten,\n- die Erarbeitung von EDV-Software und Werbematerialien (Internetauftritt),\n- gutachterliche Stellungnahmen,\n- Qualitätsprüfungen sowie technische, chemische und ähnliche Untersuchungen.\n\nVoraussetzung für eine Förderung ist die Einbeziehung eines neutralen Qualitätssicherers durch den Zuwendungsempfänger. Mit diesem hat der Zuwendungsempfänger einen Qualitätssicherungsvertrag abzuschließen.\n\nZuwendungen nach der Beratungsrichtlinie Ziffer 2.1 sind keine \"De-minimis\"-Beihilfen."]
["BAFA Junge Unternehmen","Förderung unternehmerischen Know-hows (Unternehmensberatungen ab 2016)","Bundesamt für Wirtschaft und Ausfuhrkontrolle (BAFA)","max. 2 Jahre nach Gründung","max. 5, min. 1","bis zu 80 % Zuschuss\n\nmax. 3.200 Euro Gesamtzuschuss je Beratungsart","Allgemeine Beratungen zu allen wirtschaftlichen, finanziellen, personellen und organisatorischen Fragen der Unternehmensführung.\n\nUm strukturellen Ungleichheiten zu begegnen, können zusätzlich zu den Themen einer allgemeinen Beratung weitere Beratungsleistungen gefördert werden. Hierzu gehören Beratungen von Unternehmen, die von Frauen geführt werden, von Migrantinnen oder Migranten geführt werden, von Unternehmern/innen mit anerkannter Behinderung geführt werden, zur besseren betrieblichen Integration von Mitarbeiterinnen oder Mitarbeitern mit Migrationshintergrund beitragen, zur Arbeitsgestaltung für Mitarbeiterinnen oder Mitarbeiter mit Behinderung beitragen, zur Fachkräftegewinnung und -sicherung beitragen, zur Gleichstellung und besseren Vereinbarkeit von Familie und Beruf beitragen, zur alternsgerechten Gestaltung der Arbeit beitragen bzw. zur Nachhaltigkeit und zum Umweltschutz beitragen.",400,"Die Unternehmen müssen ihren Sitz in der Bundesrepublik Deutschland haben und der EU-Mittelstandsdefinition für kleine und mittlere Unternehmen entsprechen. Zusätzlich müssen Unternehmen in Schwierigkeiten die Voraussetzungen im Sinne von Nummer 20 Buchstabe a oder Nummer 20 Buchstabe b der Leitlinien für staatliche Beihilfen zur Rettung und Umstrukturierung nichtfinanzieller Unternehmen in Schwierigkeiten (2014/249/01) in der jeweils geltenden Fassung erfüllen.\n\nAls Gründungsdatum zählt bei gewerblich Tätigen der Tag der Gewerbeanmeldung bzw. des Handelsregisterauszugs, bei Freiberuflern die Anmeldung beim Finanzamt.\n\nNicht antragsberechtigt sind unabhängig vom Beratungsbedarf Unternehmen sowie Angehörige der Freien Berufe, die in der Unternehmens-, Wirtschaftsberatung, Wirtschafts- oder Buchprüfung oder Steuerberatung bzw. als Rechtsanwalt, Notar, Insolvenzverwalter oder in ähnliche Weise beratend oder schulend tätig sind oder tätig werden wollen, Unternehmen, über deren Vermögen ein Insolvenzverfahren eröffnet wurde oder die die Voraussetzungen für die Eröffnung eines solchen Verfahrens erfüllen, Unternehmen, die in einem Beteiligungsverhältnis zu Religionsgemeinschaften, juristischen Personen des öffentlichen Rechts oder zu deren Eigenbetriebe stehen bzw. Gemeinnützige Unternehmen und gemeinnützige Vereine sowie Stiftungen.\n\nZu beachten ist des Weiteren, dass Beratungen von Unternehmen, z. B. Unternehmen der landwirtschaftlichen Primärerzeugung, der Fischerei und Aquakultur oder zu Inhalten, die gemäß Artikel 1 Absatz 1 der Verordnung (EU) Nr. 1407/2013 ausgeschlossen sind, nicht gefördert werden können."]
["BAFA Bestandsunternehmen","Förderung unternehmerischen Know-hows (Unternehmensberatungen ab 2016)","Bundesamt für Wirtschaft und Ausfuhrkontrolle (BAFA)","ab 3. Jahr nach Gründung","max. 5, min. 1","bis zu 80 % Zuschuss\n\nmax. 2.400 Euro Gesamtzuschuss je Beratungsart","Allgemeine Beratungen zu allen wirtschaftlichen, finanziellen, personellen und organisatorischen Fragen der Unternehmensführung.\n\nUm strukturellen Ungleichheiten zu begegnen, können zusätzlich zu den Themen einer allgemeinen Beratung weitere Beratungsleistungen gefördert werden. Hierzu gehören Beratungen von Unternehmen, die von Frauen geführt werden, von Migrantinnen oder Migranten geführt werden, von Unternehmern/innen mit anerkannter Behinderung geführt werden, zur besseren betrieblichen Integration von Mitarbeiterinnen oder Mitarbeitern mit Migrationshintergrund beitragen, zur Arbeitsgestaltung für Mitarbeiterinnen oder Mitarbeiter mit Behinderung beitragen, zur Fachkräftegewinnung und -sicherung beitragen, zur Gleichstellung und besseren Vereinbarkeit von Familie und Beruf beitragen, zur alternsgerechten Gestaltung der Arbeit beitragen bzw. zur Nachhaltigkeit und zum Umweltschutz beitragen.",400,"Die Unternehmen müssen ihren Sitz in der Bundesrepublik Deutschland haben und der EU-Mittelstandsdefinition für kleine und mittlere Unternehmen entsprechen. Zusätzlich müssen Unternehmen in Schwierigkeiten die Voraussetzungen im Sinne von Nummer 20 Buchstabe a oder Nummer 20 Buchstabe b der Leitlinien für staatliche Beihilfen zur Rettung und Umstrukturierung nichtfinanzieller Unternehmen in Schwierigkeiten (2014/249/01) in der jeweils geltenden Fassung erfüllen.\n\nAls Gründungsdatum zählt bei gewerblich Tätigen der Tag der Gewerbeanmeldung bzw. des Handelsregisterauszugs, bei Freiberuflern die Anmeldung beim Finanzamt.\n\nNicht antragsberechtigt sind unabhängig vom Beratungsbedarf Unternehmen sowie Angehörige der Freien Berufe, die in der Unternehmens-, Wirtschaftsberatung, Wirtschafts- oder Buchprüfung oder Steuerberatung bzw. als Rechtsanwalt, Notar, Insolvenzverwalter oder in ähnliche Weise beratend oder schulend tätig sind oder tätig werden wollen, Unternehmen, über deren Vermögen ein Insolvenzverfahren eröffnet wurde oder die die Voraussetzungen für die Eröffnung eines solchen Verfahrens erfüllen, Unternehmen, die in einem Beteiligungsverhältnis zu Religionsgemeinschaften, juristischen Personen des öffentlichen Rechts oder zu deren Eigenbetriebe stehen bzw. Gemeinnützige Unternehmen und gemeinnützige Vereine sowie Stiftungen.\n\nZu beachten ist des Weiteren, dass Beratungen von Unternehmen, z. B. Unternehmen der landwirtschaftlichen Primärerzeugung, der Fischerei und Aquakultur oder zu Inhalten, die gemäß Artikel 1 Absatz 1 der Verordnung (EU) Nr. 1407/2013 ausgeschlossen sind, nicht gefördert werden können."]
["Betriebsberatung Sachsen","Mittelstandsrichtlinie Sachsen - Betriebsberatung/Coaching","Sächsische AufbauBank (SAB)","sofern Gründung in den letzten 2 Jahren zuerst BAFA-Beratung","min. 5","bis zu 50 % Zuschuss, d. h. max. 350 € pro TW: (Beraterhonorar + Ellipsis Deckungsbeitrag) / 2\n\nmax. 6.000 € (bei 12.000 € förderfähigen Ausgaben) innerhalb von drei Jahren und Schwerpunkt Umweltmanagement\n\nmax. 8.000 € (bei 16.000 € förderfähigen Ausgaben) pro Jahr und folgenden Beratungsschwerpunkten:\nStrategieentwicklung, Digitalisierung des Geschäftsmodells, Wissensbilanz, Umweltberatung\n\nmax. 10.000 € (bei 20.000 € förderfähigen Ausgaben) pro Jahr und folgenden Beratungsschwerpunkten:\nIn- und ausländische Märkte, Personalentwicklung und Fachkräftesicherung, Unternehmensnachfolge","Die Beratungen umfassen folgende Schwerpunkte:\n- Strategieentwicklung\n- Digitalisierung des Geschäftsmodells\n- Wissensbilanz\n- Umweltberatung\n- In- und ausländische Märkte\n- Personalentwicklung und Fachkräftesicherung\n- Unternehmensnachfolge\n\n- spezieller Punkt: Umweltmanagement (bitte telefonisch erfragen)",80,"KMU mit Sitz in Sachsen\n\nEine Beratungsförderung kann innerhalb von 12 Monaten nur einmal in Anspruch genommen werden\n\nCoaching zum selben Schwerpunkt ist von Beratungspause ausgenommen\n\nBeratungen mit weniger als 5 Tagewerken sind nicht zuwendungsfähig\n\nJunge Unternehmen (bis 2 Jahre nach ihrer Gründung) müssen zuvor eine Gründungsberatung der Bundesrepublik Deutschland in Anspruch genommen haben\n\nFür Beratungen mit Schwerpunktsetzung in den Bereichen Außenwirtschaft bzw. Umwelt soll bei Antragstellung nachgewiesen werden, dass eine kostenfreie Erstberatung bei einem Außenwirtschafts- bzw. Umweltberater der sächsischen Industrie- und Handelskammern oder Handwerkskammern vorgeschaltet ist."]
["Coaching Sachsen","Mittelstandsrichtlinie Sachsen - Betriebsberatung/Coaching","Sächsische AufbauBank (SAB)","sofern Gründung in den letzten 2 Jahren zuerst BAFA-Beratung","min. 5 (max. die Hälfte der Tagewerke aus der vorangegangenen Betriebsberatung)","bis zu 50 % Zuschuss, d. h. max. 350 € pro TW: (Beraterhonorar + Ellipsis Deckungsbeitrag) / 2\n\nmax. 6.000 € (bei 12.000 € förderfähigen Ausgaben) innerhalb von drei Jahren und Schwerpunkt Umweltmanagement\n\nmax. 8.000 € (bei 16.000 € förderfähigen Ausgaben) pro Jahr und folgenden Beratungsschwerpunkten:\nStrategieentwicklung, Digitalisierung des Geschäftsmodells, Wissensbilanz, Umweltberatung\n\nmax. 10.000 € (bei 20.000 € förderfähigen Ausgaben) pro Jahr und folgenden Beratungsschwerpunkten:\nIn- und ausländische Märkte, Personalentwicklung und Fachkräftesicherung, Unternehmensnachfolge","Die Beratungen umfassen folgende Schwerpunkte:\n- Strategieentwicklung\n- Digitalisierung des Geschäftsmodells\n- Wissensbilanz\n- Umweltberatung\n- In- und ausländische Märkte\n- Personalentwicklung und Fachkräftesicherung\n- Unternehmensnachfolge\n\n- spezieller Punkt: Umweltmanagement (bitte telefonisch erfragen)",80,"KMU mit Sitz in Sachsen\n\nEine Beratungsförderung kann innerhalb von 12 Monaten nur einmal in Anspruch genommen werden\n\nCoaching zum selben Schwerpunkt ist von Beratungspause ausgenommen\n\nBeratungen mit weniger als 5 Tagewerken sind nicht zuwendungsfähig\n\nJunge Unternehmen (bis 2 Jahre nach ihrer Gründung) müssen zuvor eine Gründungsberatung der Bundesrepublik Deutschland in Anspruch genommen haben\n\nFür Beratungen mit Schwerpunktsetzung in den Bereichen Außenwirtschaft bzw. Umwelt soll bei Antragstellung nachgewiesen werden, dass eine kostenfreie Erstberatung bei einem Außenwirtschafts- bzw. Umweltberater der sächsischen Industrie- und Handelskammern oder Handwerkskammern vorgeschaltet ist."]
["Schwerpunkte BB/C Sachsen","In- und ausländische Märkte","nein"]
[null,"Digitalisierung des Geschäftsmodells","ja"]
[null,"Personalentwicklung und Fachkräftesicherung"]
[null,"Strategieentwicklung"]
[null,"Umweltberatung"]
[null,"Unternehmensnachfolge"]
[null,"Wissensbilanz"]
[null,"Umweltmanagement"]
{"$rows_left_out":1}
{"sheet":"alt","index":2,"n_rows":12,"n_cols":7,"rows_kept":12,"cut":false,"hidden":true,"merged":[]}
[null,"Gründerrichtlinie Thüringen","Beratungsrichtlinie Thüringen","BAFA Junge Unternehmen","BAFA Bestandsunternehmen","Betriebsberatung Sachsen","Coaching Sachsen"]
["Name des Förderprogramms","Thüringer Beratungsrichtlinie","Thüringer Beratungsrichtlinie","Förderung unternehmerischen Know-hows (Unternehmensberatungen ab 2016)","Förderung unternehmerischen Know-hows (Unternehmensberatungen ab 2016)","Mittelstandsrichtlinie Sachsen - Betriebsberatung/ Coaching","Mittelstandsrichtlinie Sachsen - Betriebsberatung/ Coaching"]
["Zuständig für Zuwendungsbescheid","GFAW – Gesellschaft für Arbeits- und Wirtschaftsförderung des Freistaats Thüringen mbH","GFAW – Gesellschaft für Arbeits- und Wirtschaftsförderung des Freistaats Thüringen mbH","Bundesamt für Wirtschaft und Ausfuhrkontrolle (BAFA)","Bundesamt für Wirtschaft und Ausfuhrkontrolle (BAFA)","Sächsische AufbauBank (SAB)","Sächsische AufbauBank (SAB)"]
["Unternehmensalter","vor Gründung","ab 1. Tag der Gründung, BAFA für Junge Unternehmen ist vorher auszuschöpfen","bis 2 Jahre nach Gründung","ab 3. Jahr nach Gründung","sofern jünger als 3 Jahre nach Gründung zuerst BAFA-Beratung","sofern jünger als 3 Jahre nach Gründung zuerst BAFA-Beratung"]
["Mögliche Anzahl Tagewerke","3 TW bis 20 TW","6 TW bis in der Regel 20 TW je Projekt","keine Begrenzung","1 TW bis 5 TW","mind. 5","mind. 5, jedoch max. die Hälfte der Tagewerke aus der vorangegangenen Betriebsberatung"]
["Zuschuss","bis zu 70% Zuschuss, max. 500 € Zuschuss je TW (Beraterhonorar) und max. 50 € je TW (Ellipsis-Honorar)","bis zu 50% Zuschuss, max. 400 € je TW (Beraterhonorar) und max. 50 € je TW (Ellipsis-Honorar)","bis zu 80 % Zuschuss, max. 3.200 Euro Gesamtzuschuss je Beratungsart","bis zu 80 % Zuschuss, max. 2.400 Euro Gesamtzuschuss je Beratungsart","bis zu 50 % Zuschuss\n\nmax. 350 € pro TW (Beraterhonorar + Ellipsis Deckungsbeitrag)\n\nmax. 8.000 € (bei 16.000 € förderfähigen Ausgaben) pro Jahr und folgenden Beratungsschwerpunkten:\n- Strategieentwicklung\n- Digitalisierung des Geschäftsmodells\n- Wissensbilanz\n- Umweltberatung\n\nmax. 10.000 € (bei 20.000 € förderfähigen Ausgaben) pro Jahr und folgenden Beratungsschwerpunkten:\n- In- und ausländische Märkte\n- Personalentwicklung und Fachkräftesicherung\n- Unternehmensnachfolge","bis zu 50 % Zuschuss\n\nmax. 350 € pro TW (Beraterhonorar + Ellipsis Deckungsbeitrag)\n\nmax. 8.000 € (bei 16.000 € förderfähigen Ausgaben) pro Jahr und folgenden Beratungsschwerpunkten:\n- Strategieentwicklung\n- Digitalisierung des Geschäftsmodells\n- Wissensbilanz\n- Umweltberatung\n\nmax. 10.000 € (bei 20.000 € förderfähigen Ausgaben) pro Jahr und folgenden Beratungsschwerpunkten:\n- In- und ausländische Märkte\n- Personalentwicklung und Fachkräftesicherung\n- Unternehmensnachfolge"]
["Ellipsis Deckungsbeitrag/ Honorar",90,90,100,100,80,80]
["Beratungsinhalte","Die Beratungen umfassen folgende Schwerpunkte:\n- Strategien und Geschäftsideen\n- Personal und Organisation\n- Finanzierung und Investitionen\n- Unternehmenswachstum und Wettbewerbsfähigkeit\n- Technologietransfer und Technologieanwendung\n- Produktportfolio\n- Marktanalysen und Marketing\n- Materialeffizienz\n- Unternehmensnachfolge","Die Beratungen umfassen folgende Schwerpunkte:\n- Digitalisierung\n- Unternehmenswachstum und Wettbewerbsfähigkeit\n- Personalmanagement und Organisationsentwicklung\n- Finanzierung und Investitionen\n- Innovationsmanagement\n- Internationalisierung\n- Rationalisierungsmaßnahmen und Kostensenkungen, Technologietransfer und zur Technologieanwendung\n- Produktportfolio, Marktanalysen und Marketing\n- Strategie und Geschäftsideen\n- Materialeffizienz\n- Unternehmensnachfolge\n- Kooperation von Unternehmen",null,null,"Die Beratungen umfassen folgende Schwerpunkte:\n- Strategieentwicklung\n- In- und ausländische Märkte\n- Digitalisierung des Geschäftsmodells\n- Personalentwicklung und Fachkräftesicherung\n- Wissensbilanz\n- Unternehmensnachfolge\n- Umweltberatung","Die Beratungen umfassen folgende Schwerpunkte:\n- Strategieentwicklung\n- In- und ausländische Märkte\n- Digitalisierung des Geschäftsmodells\n- Personalentwicklung und Fachkräftesicherung\n- Wissensbilanz\n- Unternehmensnachfolge\n- Umweltberatung"]
["Sonstige Bestimmungen ",null,null,null,null,"KMU mit Sitz in Sachsen\n\nEine Beratungsförderung kann innerhalb von 12 Monaten nur einmal in Anspruch genommen werden\n\nCoaching zum selben Schwerpunkt ist von Beratungspause ausgenommen\n\nBeratungen mit weniger als 5 Tagewerken sind nicht zuwendungsfähig\n\nJunge Unternehmen (bis 2 Jahre nach ihrer Gründung) müssen zuvor eine Gründungsberatung der Bundesrepublik Deutschland in Anspruch genommen haben\n\nFür Beratungen mit Schwerpunktsetzung in den Bereichen Außenwirtschaft bzw. Umwelt soll bei Antragstellung nachgewiesen werden, dass eine kostenfreie Erstberatung bei einem Außenwirtschafts- bzw. Umweltberater der sächsischen Industrie- und Handelskammern oder Handwerkskammern vorgeschaltet ist.","KMU mit Sitz in Sachsen\n\nEine Beratungsförderung kann innerhalb von 12 Monaten nur einmal in Anspruch genommen werden\n\nCoaching zum selben Schwerpunkt ist von Beratungspause ausgenommen\n\nBeratungen mit weniger als 5 Tagewerken sind nicht zuwendungsfähig\n\nJunge Unternehmen (bis 2 Jahre nach ihrer Gründung) müssen zuvor eine Gründungsberatung der Bundesrepublik Deutschland in Anspruch genommen haben\n\nFür Beratungen mit Schwerpunktsetzung in den Bereichen Außenwirtschaft bzw. Umwelt soll bei Antragstellung nachgewiesen werden, dass eine kostenfreie Erstberatung bei einem Außenwirtschafts- bzw. Umweltberater der sächsischen Industrie- und Handelskammern oder Handwerkskammern vorgeschaltet ist."]
["Förderfähige Ausgaben Beraterhonorar"]
["Förderfähige Ausgaben Gesamtkosten"]
["Zuschuss Berechnung"]